[Date Index][Thread Index]
[Date Prev][Date Next][Thread Prev][Thread Next]

Upgrade problem



Folks,

I tried some search regarding my issue and couldn't find postings 
on a similar situation. I, therefore, expect this is not FAQ. 

I finally upgraded from perl-5.00404 to perl-5.00503 a couple of 
days ago since 5.00503 was required by a software I was trying 
to install, which was not WML, by the way.

Yesterday, I noticed wml was not working anymore. One problem seemed
that wml was looking for the old perl modules. So I reinstalled 
wml-1.7.4 using perl-5.00503, but it still didn't work.

# I didn't use wmu. I did ftp, configure, make, make install manually.

Here's a result of executing make test. 

**** MAKE TEST OUTPUT STARTS HERE ****
make[1]: Entering directory `/usr/local/src/www/authoring/wml-1.7.4/wml_test'
Running WML Test Suite (still incomplete):
t/01-p1_ipp.........ok
t/02-p2_mhc.........ok
t/03-p3_eperl.......ok
t/04-p4_gm4.........ok
t/05-p5_divert......ok
t/06-p6_asubst......ok
t/07-p7_htmlfix.....ok
t/08-p8_htmlstrip...ok
t/09-p9_slice.......Can't locate object method "Max" via package "" at /usr/local/src/www/authoring/wml-1.7.4/wml_test/TEST.root/lib/exec/wml_p9_slice line 662.
** WML:Break: Error in Pass 9 (rc=255).
cmp: EOF on tmp.02
FAILED tests 1-2
	Failed 2/2 tests, 0.00% okay
t/10-wml............Can't locate object method "Norm" via package "" at /usr/local/src/www/authoring/wml-1.7.4/wml_test/TEST.root/lib/exec/wml_p9_slice line 749.
** WML:Break: Error in Pass 9 (rc=255).
cmp: EOF on tmp.02
Can't locate object method "Norm" via package "" at /usr/local/src/www/authoring/wml-1.7.4/wml_test/TEST.root/lib/exec/wml_p9_slice line 749.
** WML:Break: Error in Pass 9 (rc=255).
cmp: EOF on tmp.05
FAILED tests 1-4
	Failed 4/4 tests, 0.00% okay
t/11-wmk............FAILED tests 1-4
	Failed 4/4 tests, 0.00% okay
t/des-gfont.........ePerl:Error: Perl runtime error (interpreter rc=1)

---- Contents of STDERR channel: ---------
sh: gfont: not found
sh: gfont: not found
** wml::des::gfont:
------------------------------------------
** WML:Break: Error in Pass 3 (rc=74).
cmp: EOF on tmp.02
ePerl:Error: Perl runtime error (interpreter rc=1)

---- Contents of STDERR channel: ---------
sh: gfont: not found
sh: gfont: not found
** wml::des::gfont:
------------------------------------------
** WML:Break: Error in Pass 3 (rc=74).
cmp: EOF on tmp.05
ePerl:Error: Perl runtime error (interpreter rc=1)

---- Contents of STDERR channel: ---------
sh: gfont: not found
sh: gfont: not found
** wml::des::gfont:
------------------------------------------
** WML:Break: Error in Pass 3 (rc=74).
cmp: EOF on tmp.08
FAILED tests 1-6
	Failed 6/6 tests, 0.00% okay
t/des-navbar........Can't locate object method "Norm" via package "" at /usr/local/src/www/authoring/wml-1.7.4/wml_test/TEST.root/lib/exec/wml_p9_slice line 749.
** WML:Break: Error in Pass 9 (rc=255).
cmp: EOF on tmp.02
Can't locate object method "Norm" via package "" at /usr/local/src/www/authoring/wml-1.7.4/wml_test/TEST.root/lib/exec/wml_p9_slice line 749.
** WML:Break: Error in Pass 9 (rc=255).
cmp: EOF on tmp.05
FAILED tests 1-4
	Failed 4/4 tests, 0.00% okay
t/des-space.........Can't locate object method "Norm" via package "" at /usr/local/src/www/authoring/wml-1.7.4/wml_test/TEST.root/lib/exec/wml_p9_slice line 749.
** WML:Break: Error in Pass 9 (rc=255).
cmp: EOF on tmp.02
FAILED tests 1-2
	Failed 2/2 tests, 0.00% okay
Failed Test  Status Wstat Total Fail  Failed  List of failed
-------------------------------------------------------------------------------
t/09-p9_slice.t               2    2 100.00%  1-2
t/10-wml.t                    4    4 100.00%  1-4
t/11-wmk.t                    4    4 100.00%  1-4
t/des-gfont.t                 6    6 100.00%  1-6
t/des-navbar.t                4    4 100.00%  1-4
t/des-space.t                 2    2 100.00%  1-2
Failed 6/14 test scripts, 57.14% okay. 22/46 subtests failed, 52.17% okay.
make[1]: [test] Error 29 (ignored)
make[1]: Leaving directory `/usr/local/src/www/authoring/wml-1.7.4/wml_test'
**** MAKE TEST OUTPUT ENDS HERE ****

I tried wml-1.99.1 installed in a different location on the same host
and it gave me the same result.

Something seems to go wrong with Bit::Vector, so I looked at
$WML_PREFIX/lib/perl/lib/5.00503/sun4-solaris/Bit/Vector.pm 
but couldn't fiture out what's wrong.

I use WML in the following configuration:

Solaris 7, Perl-5.00503, WML-1.7.4 

Any hints would be deeply appreciated.

-- Daisuke Yabuki
______________________________________________________________________
Website META Language (WML)                www.engelschall.com/sw/wml/
Official Support Mailing List                   sw-wml@engelschall.com
Automated List Manager                       majordomo@engelschall.com